﻿Participant_no,Group,Target_Fruit,Target_Fruit_status,Target_Vegetable,Target_Veg_status,BL_ageinmonths,Gender,Child_ethnicity,Parent_qualifications,Parent_marital_status,Parent_income,N_childreninhome,BL_Frequency_family_meals,BL_Total_veg_purchases,BL_Target_veg_purchases,BL_Total_fruit_purchases,BL_Target_fruit_purchases,BL_CFNS,BL_CEBQFF,BL_Daily_fruit_intake,BL_Daily_veg_intake,BL_Target_fruit_intake,BL_Target_veg_intake,BL_Target_fruit_liking,BL_Target_veg_liking,PI_ageinmonths,PI_CFNS,PI_CEBQFF,PI_Target_fruit_intake,PI_Target_veg_intake,PI_Target_fruit_liking,PI_Target_veg_liking,FU_ageinmonths,FU_CFNS,FU_CEBQFF,FU_Target_fruit_intake,FU_Target_veg_intake,FU_Target_fruit_liking,FU_Target_veg_liking,Diary_Returned,NOffersFruit,NOffersVeg,NTastesFruit,NTastesVeg
1,Vegetable,kiwi, ,tomato, ,25.33,female,White British,degree or higher,rest,£50+,1,6.5,56,2,31,1,13,15,4.23,5.06,0,0,Dislikes,Strongly dislikes, , , , , , , , , , , , , , ,no, , , , 
3,Control,Oranges, ,Sprouts, ,19.87,female,Other,rest,rest,rest,4,16.5,23, ,13,2,16,18,3.28,3.41,.07,0,Likes, , , , , , , , , , , , , , , ,no, , , , 
4,Control,strawberries, ,asparagus, ,20.8,female,White British,rest,rest,rest,3,17,38,1,45,2, , , ,6.48,2,2,Neither likes nor dislikes,Never tried, , , , , , , , , , , , , , ,no, , , , 
5,Control,Dates, ,aubergine, ,20.67,female,White British,degree or higher,married,£50+,2,18.5,40,0,40,1,7,9,4.42,4.13,0,0,Never tried,Never tried, , , , , , , , , , , , , , ,no, , , , 
22,Control,Bananas,Disliked,Broccoli,Disliked,23.3,male,White British,rest,married,rest,2,11.5,33,1,27,2,13,17,3.14,2.87,.14,.14,Dislikes,Dislikes,25.4666666666667,13,17,.29,.14,Strongly likes,Likes,29.1333333333333,13,18,.29,.29,Likes,Likes,no, , , , 
32,Control,strawberries,Disliked,asparagus,Unfamiliar,23.03,female,White British,rest,married,rest,1,12,33,0,26,2,11,15,1.78,2.85,0,0,Neither likes nor dislikes,Never tried,25.8,22,21,0,0,Strongly dislikes,Strongly dislikes,29.3,15,16,0,0,Dislikes,Dislikes,no, , , , 
41,Fruit,tomato, ,courgette, ,22.17,male,White British,degree or higher,married,£50+,2,10,47,2,16,2,15,17,1.49,1.28,0,0,Strongly dislikes,Dislikes, , , , , , , , , , , , , , ,no, , , , 
42,Fruit,Avocado, ,Carrot, ,22.07,female,White British,degree or higher,married,£50+,1,5,38,2,38,1,16,18,3.71,2.14,0,0,Dislikes,Dislikes, , , , , , , , , , , , , , ,no, , , , 
43,Fruit,Apple, ,Spinach, ,20.93,female,White British,rest,rest,rest,1,10,28,1,22,1,16,21,3.15,3.28,0,0,Dislikes,Dislikes, , , , , , , , , , , , , , ,no, , , , 
44,Fruit,Tomato, ,Broccoli, ,21.87,male,White British,rest,married,£50+,1,8,48,2,35,2,13,16,4.2,3.22,0,.07,Strongly dislikes,Dislikes, , , , , , , ,27,15,20,0,0,Strongly dislikes,Strongly dislikes,no, , , , 
45,Fruit,Grapes, ,Broccoli, ,22.47,male,White British,rest,rest,rest,1,8.5,17,2,21,2,13,13,5.35,2.71,0,.07,Strongly dislikes,Strongly dislikes, , , , , , , , , , , , , , ,no, , , , 
46,Fruit,oranges, ,tomatoes, ,24.23,female,White British,degree or higher,married,£50+,2,3,46,2,25,0,17,19,4.35,1.84,0,0,Never tried,Neither likes nor dislikes, , , , , , , , , , , , , , ,no, , , , 
47,Fruit,strawberry, ,peppers, ,18.63,female,White British,rest,married,rest,1, ,38,2,30,2,14,16,1.71,7.56,0,0,Strongly dislikes,Strongly dislikes, , , , , , , , , , , , , , ,no, , , , 
48,Fruit,banana, ,cucumber, ,21.5,female,White British,degree or higher,married,£50+,2,6.5,45,2,33,2,8,15,.71,3.45,0,0,Neither likes nor dislikes,Strongly dislikes, , , , , , , , , , , , , , ,no, , , , 
70,Fruit,Strawberries,Disliked,Green beans,Disliked,21.87,male,White British,degree or higher,married,£50+,1,10.5,41,0,16,1,21,24,3.94,2.21,0,0,Strongly dislikes,Never tried,23.8,23,24,.07,.07,Neither likes nor dislikes,Dislikes, , , , , , , ,no, , , , 
79,Fruit,papaya,Unfamiliar,broccoli,Disliked,20.43,female,White British,rest,rest,£50+,3,17,38,2,33,1,8,9,3.86,2.79,0,.14,Strongly dislikes,Dislikes,22.8,10,17,0,0,Dislikes,Dislikes, , , , , , , ,no, , , , 
83,Vegetable,bananas, ,peas, ,20.7,male,White British,rest,married,rest,1,10,12,1,14,1,24,26,.42,.84,.07,.14,Likes,Likes, , , , , , , , , , , , , , ,no, , , , 
84,Vegetable,bananas, ,carrots, ,22,female,White British,rest,rest,rest,1,11.5,12,2,13,1,12,15,1.14,0,0,0,Strongly dislikes,Strongly dislikes, , , , , , , , , , , , , , ,no, , , , 
86,Vegetable,passion fruit, ,carrot, ,21.2,female,White British,rest,married,rest,2,8.5,59,2,46,0,21,21,4.65,3.44,1,3,Never tried,Strongly dislikes, , , , , , , , , , , , , , ,no, , , , 
87,Vegetable,Mango, ,sweetcorn, ,19.57,male,Other,rest,rest,£50+,1,11.5,44,1,39,1,9,10,7.35,3.13,0,0,Strongly dislikes,Strongly dislikes, , , , , , , , , , , , , , ,no, , , , 
88,Vegetable,melon, ,cabbage, ,20,female,White British,rest,married, ,2,18.5,32,2,27,1,12,18,1.93,3,0,.14,Dislikes,Dislikes, , , , , , , , , , , , , , ,no, , , , 
89,Vegetable,tomato, ,broccoli, ,19.93,female,Other,degree or higher,rest,£50+,1,8.5,41,2,29,2,23,24,5.35,1.94,.29,0,Neither likes nor dislikes,Dislikes, , , , , , , , , , , , , , ,no, , , , 
90,Vegetable,banana, ,cauliflower, ,20.87,male,White British,degree or higher,married,rest,2,15,31,1,20,2,14,20,2.78,4.99,.43,0,Dislikes,Strongly dislikes, , , , , , , , , , , , , , ,no, , , , 
91,Vegetable,Orange, ,Aubergine, ,22.3,male,White British,rest,married,rest,2,16.5,38,1,34,2,10,12,3.36,2.86,0,0,Strongly dislikes,Never tried, , , , , , , , , , , , , , ,no, , , , 
112,Vegetable,pear,Disliked,broccoli,Disliked,20.4,male,White British,rest,rest,£50+,3,13.5,44,2,35,2,14,18,2.78,2.65,.07,.29,Dislikes,Neither likes nor dislikes,22.8,15,20,.07,.29,Dislikes,Likes, , , , , , , ,no, , , , 
113,Vegetable,grapes,Disliked,carrotts,Disliked,20.37,female,White British,rest,rest,rest,1,11.5,19,2,18,1,17,21,1.78,1.93,0,.07,Strongly dislikes,Strongly dislikes,23.1666666666667,14,18,.43,.29,Likes,Strongly likes, , , , , , , ,no, , , , 
124,Vegetable,Oranges,Unfamiliar,Tomato,Disliked,19.17,male,Other,degree or higher,married,£50+,4,20,43,2,34,1,19,25,1.27,1.21,0,.43,Strongly dislikes,Strongly dislikes,21,19,20,1,.14,Strongly likes,Dislikes,24.7666666666667,17,20,.43,.14,Strongly likes,Dislikes,no, , , , 
2,Control,clementine, ,courgette, ,22.73,male,White British,degree or higher,married, ,2,15,34,2,23,1,15,18,1.07,1.49,0,0,Never tried,Dislikes, , , , , , , , , , , , , , ,yes,14,12,11,11
6,Control,raspberries,Disliked,peppers,Disliked,20.8,male,White British,degree or higher,rest,£50+,1,10,26,2,14,0,15,18,4,1.13,0,0,Strongly dislikes,Strongly dislikes,23.1,14,20,0,0,Strongly dislikes,Strongly dislikes,26.7333333333333,21,25,0,0,Strongly dislikes,Dislikes,yes,12,14,1,3
7,Control,pear,Disliked,green beans,Disliked,19.6,male,White British,rest,rest,rest,2,16.5,44,1,55,2,12,12,6.57,8.28,0,0,Dislikes,Strongly dislikes,22.2,12,14,.43,.07,Likes,Dislikes,25.3666666666667,12,13,.29,0,Likes,Strongly dislikes,yes,15,15,11,7
8,Control,Grapes,Disliked,Broccoli,Disliked,19.73,male,White British,degree or higher,married,£50+,1,11.5,32,1,18,1,22,22,4,2.28,0,0,Dislikes,Dislikes,21.4666666666667,21,23,0,0,Never tried,Dislikes,26.3666666666667,24,25,0,0,Dislikes,Dislikes,yes,14,13,0,1
9,Control,peaches,Disliked,Tomatoes,Disliked,19.43,male,White British,degree or higher,married,rest,1,10,55,2,46,1,12,16,3.63,6.07,0,0,Never tried,Dislikes,21.4,11,14,1,1,Likes,Neither likes nor dislikes, , , , , , , ,yes,14,15,6,8
10,Control,Strawberry,Disliked,Mushrooms,Disliked,20.13,female,White British,degree or higher,married,rest,3,18.5,41,1,33,2,8,12,2.77,1.77,0,0,Strongly dislikes,Strongly dislikes,21.4666666666667,8,11,1,0,Strongly likes,Strongly dislikes,25.5666666666667,9,11,0,0,Strongly likes,Strongly dislikes,yes,13,13,12,4
11,Control,pineapple,Disliked,peppers,Disliked,19.1,male,White British,degree or higher,married, ,1, ,45,2,30,1,7,12,2.16,2.15,0,0,Dislikes,Dislikes,20.8333333333333,10,13,0,0,Likes,Likes,25.9333333333333,12,15,0,.14,Dislikes,Likes,yes,15,15,3,5
12,Control,plum,Disliked,cauliflower,Disliked,20.6,female,White British,degree or higher,married,£50+,2,5,42,0,20,0,14,17,2.14,3.08,0,.07,Dislikes,Dislikes,22.4,14,18,1,.71,Likes,Dislikes,25.5,19,23,.14,.07,Likes,Neither likes nor dislikes,yes,15,15,12,13
13,Control,pineapple,Disliked,cauliflower,Disliked,22.63,female,White British,rest,married,rest,1,3,34,1,30,1,15,19,2.46,1.48,0,0,Strongly dislikes,Strongly dislikes,24.2666666666667,13,19,.14,.29,Strongly likes,Strongly dislikes,27.3666666666667,17,17,.14,.07,Strongly likes,Strongly dislikes,yes,13,13,13,12
14,Control,kiwi fruit,Disliked,tomatoes,Disliked,21.03,male,Other,degree or higher,married,£50+,2,15.5,30,2,24,0,10,13,3.77,3.57,0,0,Never tried,Dislikes,22.6666666666667,12,16,1,0,Strongly likes,Strongly dislikes, , , , , , , ,yes,15,15,15,0
15,Control,mango,Disliked,cucumber,Disliked,21.13,female,White British,degree or higher,married,£50+,1,12,50,1,33,1,6,6,5.79,5.78,3,1,Strongly dislikes,Strongly dislikes,22.7666666666667,9,10,1,1,Likes,Neither likes nor dislikes,26.5666666666667,6,11,.14,0,Neither likes nor dislikes,Dislikes,yes,15,15,15,15
16,Control,Banana,Disliked,Carrots,Disliked,18.63,male,White British,rest,rest,rest,1,10,33,2,28,2,10,14,2.14,1.78,0,.14,Neither likes nor dislikes,Dislikes,20.5333333333333,12,16,.29,.07,Likes,Neither likes nor dislikes, , , , , , , ,yes,13,13,13,9
17,Control,Apple,Disliked,Green Beans,Disliked,22.97,female,White British,degree or higher,married,£50+,1,8.5,41,2,34,2,8,12,2.01,3.29,0,0,Strongly dislikes,Strongly dislikes,25.3333333333333,12,15,.07,.07,Neither likes nor dislikes,Dislikes, , , , , , , ,yes,15,13,13,9
18,Control,melon,Disliked,peas,Disliked,22.8,female,White British,degree or higher,rest,rest,2,16.5,49,2,23,2,12,13,1.06,5.12,.07,.07,Dislikes,Dislikes,24.8,12,14,0,.43,Strongly dislikes,Likes,28.4333333333333,12,15,0,.43,Strongly dislikes,Likes,yes,13,13,1,9
19,Control,satsuma,Disliked,tomato,Disliked,20.33,male,White British,degree or higher,married,£50+,2,15.5,31,2,33,1,15,18,3.93,2.87,0,0,Dislikes,Never tried,22.8,14,18,.29,.07,Likes,Strongly dislikes,26.0666666666667,17,19,0,0,Neither likes nor dislikes,Strongly dislikes,yes,11,10,8,3
20,Control,bananas,Disliked,carrots,Disliked,23.47,female,White British,degree or higher,married, ,1, ,43,2,29,2,24,26,.57,1.64,.07,.14,Neither likes nor dislikes,Neither likes nor dislikes,26.2666666666667,22,23,.07,.14,Neither likes nor dislikes,Neither likes nor dislikes,29.9,18,22,.07,.14,Neither likes nor dislikes,Neither likes nor dislikes,yes,11,13,0,0
21,Control,Apple,Disliked,Cauliflower,Disliked,19.23,male,White British,rest,rest,rest,1,5,28,0,6,0,13,18,.21,1.54,0,0,Dislikes,Dislikes,21.9666666666667,13,17,.14,0,Likes,Strongly dislikes,25.2,21,22,.14,0,Likes,Dislikes,yes,13,13,12,3
23,Control,Pear,Disliked,Lettuce,Disliked,21.93,female,White British,rest,rest,rest,2,15,33,1,21,1,7,9,3.65,4.58,0,0,Strongly dislikes,Strongly dislikes,23.3333333333333,7,8,0,0,Dislikes,Strongly dislikes,26.6666666666667,11,11,.07,.07,Likes,Dislikes,yes,15,15,8,10
24,Control,banana,Disliked,cauliflower,Disliked,20.9,male,White British,rest,rest,rest,3,20,26,1,20,1,13,15,.57,.99,.57,.14,Strongly dislikes,Dislikes,22.3333333333333,12,17,0,.14,Dislikes,Dislikes,25.8,13,13,0,0,Dislikes,Dislikes,yes,9,10,1,3
25,Control,grapes,Disliked,aubergine,Disliked,21.83,female,White British,degree or higher,married,£50+,2,15,36,2,23,2,12,15, , ,1,1,Dislikes,Dislikes,23.1666666666667,15,18,1,1,Dislikes,Dislikes,26.5666666666667,16,18,1,.14,Dislikes,Dislikes,yes,15,13,1,2
26,Control,strawberry,Disliked,cucumber,Disliked,21.87,male,White British,rest,married,rest,3,15,43,2,43,2,18,21,2.22,1.71,0,0,Dislikes,Dislikes,23.2333333333333,19,20,.07,.07,Neither likes nor dislikes,Dislikes,27.2,19,19,.29,0,Neither likes nor dislikes,Neither likes nor dislikes,yes,13,12,4,2
27,Control,Apricot,Disliked,Cauliflower,Disliked,21.03,male,White British,rest,rest,£50+,1,10,43,0,29,1,12,15,3.99,4.43,0,0,Strongly dislikes,Dislikes,22.1666666666667,13,18,1,1,Strongly likes,Neither likes nor dislikes,25.4333333333333,13,15,.29,.07,Strongly likes,Likes,yes,14,12,14,11
28,Control,pineapple,Disliked,broccoli,Disliked,22.23,female,White British,degree or higher,married,£50+,3,16.5,34,2,27,2,18,21,5.14,3.93, ,0,Neither likes nor dislikes,Strongly dislikes,24.2333333333333,19,22,.14,.57,Likes,Likes,27.2666666666667,17,21,.07,.57,Neither likes nor dislikes,Strongly likes,yes,14,13,8,6
29,Control,Nectarine,Disliked,Broccoli,Disliked,21.93,female,Other,degree or higher,married,rest,3,13.5,55,2,46,2,18,19,4.21,4.06,0,.14,Neither likes nor dislikes,Neither likes nor dislikes,23.3333333333333,16,18,.43,.43,Strongly likes,Neither likes nor dislikes,26.6333333333333,18,19,.43,.43,Strongly likes,Likes,yes,15,13,15,11
30,Control,Apple,Disliked,Peas,Disliked,21.2,female,White British,degree or higher,married,£50+,2,17,37,1,31,2,13,17,2.5,1.5,0,0,Dislikes,Dislikes,22.1666666666667,15,15,0,.07,Dislikes,Neither likes nor dislikes,26.1,17,19,0,.14,Strongly dislikes,Neither likes nor dislikes,yes,13,13,1,0
31,Control,strawberry,Disliked,Carrot,Disliked,22.53,female,Other,degree or higher,married,rest,1,10,15,2,23,1,14,19,5.2,1.5,.07,.14,Neither likes nor dislikes,Neither likes nor dislikes,24.0666666666667,14,18,.57,.57,Likes,Likes, , , , , , , ,yes,12,12,10,12
33,Control,CLEMENTINE,Disliked,ASPARAGUS,Unfamiliar,20.57,female,White British,rest,married,£50+,1,6.5,43,0,32,2,12,8,5.27,6.93,.43,0,Neither likes nor dislikes,Never tried,22.7666666666667,10,13,0,0,Likes,Dislikes, , , , , , , ,yes,14,14,9,5
34,Control,satsuma,Disliked,green beans,Unfamiliar,22.23,male,White British,degree or higher,married,£50+,2,11.5,56,2,38,2,14,17,2.51,3.24,0,0,Dislikes,Never tried,23.6,12,16,0,.29,Dislikes,Strongly likes,27,12,14,.07,.07,Likes,Strongly likes,yes,8,6,3,6
35,Control,cherries,Unfamiliar,beans,Disliked,19.97,female,White British,rest,rest,rest,1,4.5,31,2,29,0,11,11,2.98,3,0,.07,Neither likes nor dislikes,Dislikes,22.9,12,15,.07,0,Neither likes nor dislikes,Strongly dislikes,26.3333333333333,12,15,0,0,Neither likes nor dislikes,Strongly dislikes,yes,12,8,10,5
36,Control,Grapefruit,Unfamiliar,Green beans,Disliked,19.77,female,White British,degree or higher,married,rest,1, ,28,0,25,0,6,8,2.78,2.91,0,.07,Never tried,Dislikes,21.8333333333333,6,8,.86,.86,Neither likes nor dislikes,Neither likes nor dislikes,25.8666666666667,6,6,0,.07,Neither likes nor dislikes,Neither likes nor dislikes,yes,13,12,10,12
37,Control,pomegranate,Unfamiliar,spinach,Disliked,20.17,male,Other,degree or higher,married,rest,2,15,39,1,34,0,12,12,8.42,5.27,0,0,Never tried,Strongly dislikes,22.1,15,17,1,.43,Likes,Strongly dislikes,25.6333333333333,14,14,0,0,Likes,Strongly dislikes,yes,13,10,12,8
38,Control,pineapple,Unfamiliar,carrots,Disliked,21.9,female,Other,rest,married,rest,1,8,30,2,33,1,18,21, ,3.49,.07,.14,Neither likes nor dislikes,Neither likes nor dislikes,23.9,16,21,.07,.57,Likes,Likes,27.3,21,23,.07,.43,Likes,Likes,yes,9,9,2,8
39,Control,Cherries,Unfamiliar,Courgette,Unfamiliar,25.2,female,White British,degree or higher,married,£50+,1,5,39,0,24,0,14,18,6.49,4.71,0,0,Never tried,Never tried,26.3333333333333,17,19,0,0,Strongly dislikes,Strongly dislikes,30.3666666666667,22,24,0,0,Strongly dislikes,Strongly dislikes,yes,15,15,0,0
40,Control,kiwi,Unfamiliar,carrot,Unfamiliar,22.07,male,Other,rest,married,rest,1,10.5,22,2,16,0,17,17,6.28,2.86,0,.07,Never tried,Never tried,23.7666666666667,19,25,.57,.57,Dislikes,Likes,27.0333333333333,19,22,0,.14,Dislikes,Neither likes nor dislikes,yes,12,5,2,0
49,Fruit,Apples,Disliked,Runner Beans,Disliked,22.4,male,Other,degree or higher,married,£50+,2,13.5,31,2,35,2,13,14,3.42,5.28,.07,.29,Neither likes nor dislikes,Dislikes,24.6666666666667,12,13,.43,.29,Neither likes nor dislikes,Neither likes nor dislikes,28.5333333333333,11,12,.43,.07,Likes,Neither likes nor dislikes,yes,15,15,13,11
50,Fruit,Melon,Disliked,broccoli,Disliked,25.13,female,White British,degree or higher,married,rest,2,17,48,1,40,1,12,16,6.07,4.91,.07,.07,Neither likes nor dislikes,Dislikes,27.7666666666667,14,17,.86,.43,Likes,Neither likes nor dislikes, , , , , , , ,yes,15,15,15,14
51,Fruit,apples,Disliked,tomatoes,Disliked,24.5,male,White British,degree or higher,married,rest,2,15,56,2,36,2,24,26,6.5,1.01,.43,0,Neither likes nor dislikes,Never tried,26.9333333333333,24,29,2,0,Never tried,Never tried, , , , , , , ,yes,15,15,0,0
52,Fruit,Peaches,Disliked,Tomatoes,Disliked,21.97,female,White British,rest,married,£50+,3,15,31,2,33,1,23,23,2.15,2.36,0,0,Strongly dislikes,Strongly dislikes,24.3666666666667,23,22,1,1,Strongly likes,Strongly dislikes,28.4,24,23,.07,0,Likes,Strongly dislikes,yes,15,15,9,2
53,Fruit,Melon,Disliked,Broccoli,Disliked,19.63,female,White British,degree or higher,married,£50+,2,16.5,44,2,45,2,12,13,7.72,4.65,0,.07,Dislikes,Dislikes,21.6333333333333,12,15,.14,.43,Dislikes,Likes,25.1666666666667,12,15,.07,.43,Dislikes,Likes,yes,14,14,8,10
54,Fruit,apple,Disliked,carrots,Disliked,19.4,male,White British,degree or higher,rest,£50+,1,13.5,51,2,46,2,21,24,4.21,.84,0,.07,Dislikes,Dislikes,21.3333333333333,17,21,0,0,Dislikes,Dislikes, , , , , , , ,yes,13,11,6,0
55,Fruit,grapes,Disliked,cabbage,Disliked,20.03,female,White British,degree or higher,married,£50+,1,11.5,26,2,23,2,7,12,2.51,2.37,0,0,Dislikes,Dislikes,21.8666666666667,12,12,.57,0,Strongly likes,Dislikes,26.4,9,11,.29,0,Strongly likes,Likes,yes,11,8,11,7
56,Fruit,strawberry,Disliked,carrots,Disliked,23.2,female,White British,degree or higher,married,rest,2,15,52,2,44,2,19,18,5, ,0,0,Dislikes,Dislikes,25.2333333333333,14,16,1,0,Strongly likes,Strongly dislikes,28.5666666666667,13,16,.07,.07,Strongly likes,Dislikes,yes,15,14,13,2
57,Fruit,raspberries,Disliked,carrots,Disliked,20.87,male,White British,degree or higher,married,£50+,1,7,31,1,22,0,6,7,4.58,5.35,0,.29,Dislikes,Neither likes nor dislikes,22.9333333333333,6,11,.86,.71,Strongly likes,Dislikes,26.1333333333333,12,12,0,.57,Likes,Likes,yes,15,13,15,10
58,Fruit,mango,Disliked,broccoli,Disliked,25.03,male,White British,degree or higher,married,£50+,2,15,64,2,52,2,24,24,5.36,4.14,0,0,Strongly dislikes,Strongly dislikes,26.4,24,25,0,0,Strongly dislikes,Strongly dislikes,29.5333333333333,24,25,0,0,Strongly dislikes,Strongly dislikes,yes,13,13,0,2
59,Fruit,Strawberries,Disliked,Brocolli,Disliked,21.13,male,White British,rest,married, ,3,17,49,2,16,2,14,15,1.64,3.79,0,0,Dislikes,Dislikes,22.9,14,18,.71,.29,Strongly likes,Neither likes nor dislikes,25.9666666666667,13,16,0,.14,Strongly likes,Dislikes,yes,11,13,11,9
60,Fruit,melon,Disliked,courgette,Disliked,21,female,White British,degree or higher,married,rest,1,10,54,2,36,1,6,12,9.28,6.28,0,0,Dislikes,Dislikes,22.8333333333333,6,12,.07,0,Strongly dislikes,Strongly dislikes,26.5666666666667,6,9,0,0,Strongly dislikes,Strongly dislikes,yes,15,14,4,1
61,Fruit,apples,Disliked,green beans,Disliked,20.57,male,Other,degree or higher,rest,rest,2,15,40,2,19,1,6,7,3.36,3,.29,0,Strongly dislikes,Strongly dislikes,21.9,6,9,.43,.86,Neither likes nor dislikes,Likes,25.1333333333333,9,10,.07,.07,Neither likes nor dislikes,Likes,yes,15,14,12,12
62,Fruit,Pineapple,Disliked,Mushroom,Disliked,22.33,male,White British,degree or higher,married,£50+,1,11.5,35,1,36,1,10,15,7.55,5.14,0,.07,Strongly dislikes,Dislikes,23.5666666666667,11,13,1,0,Strongly likes,Strongly dislikes, , , , , , , ,yes,13,12,13,6
63,Fruit,Pineapple,Disliked,Courgette,Disliked,23.4,female,White British,rest, ,rest,1,12,43,2,28,1,12,15,2.44,4.29,0,0,Strongly dislikes,Dislikes,26.7333333333333,15,17,0,.07,Neither likes nor dislikes,Neither likes nor dislikes, , , , , , , ,yes,11,12,6,9
64,Fruit,blueberry,Disliked,carrot,Disliked,22.5,male,Other,rest,rest,rest,1,5,47,1,30,1,17,17,.35,1.14,0,0,Dislikes,Neither likes nor dislikes,24.3666666666667,15,19,0,.57,Dislikes,Strongly likes, , , , , , , ,yes,14,15,13,14
65,Fruit,apples,Disliked,cabbage,Disliked,18.57,male,White British,rest,rest,rest,1,6.5,18,1,9,1,12,17,.21,1.5,0,0,Neither likes nor dislikes,Neither likes nor dislikes,20.1333333333333,15,20,.71,.57,Neither likes nor dislikes,Dislikes, , , , , , , ,yes,9,7,3,2
66,Fruit,apple,Disliked,carrots,Disliked,22.1,male,White British,rest,rest,rest,2,13.5,45,2,36,1,12,17,2.28,3.36,0,0,Dislikes,Likes,23.6,11,17,1,1,Strongly likes,Strongly likes, , , , , , , ,yes,14,14,13,10
67,Fruit,orange,Disliked,swede,Disliked,23.13,male,White British,rest,married,£50+,2,20,34,1,23,2,14,16,1.72,2.87,.14,.14,Dislikes,Dislikes,25.0666666666667,12,16,1,1,Neither likes nor dislikes,Dislikes,28.6666666666667,13,15,0,0,Dislikes,Dislikes,yes,14,14,6,2
68,Fruit,Peaches,Disliked,sweet potato,Disliked,22.63,female,White British,degree or higher,married,£50+,2,15,45,1,52,2,19,23,3.36,2.35,0,0,Strongly dislikes,Strongly dislikes,24.7,20,23,0,0,Dislikes,Dislikes,28,19,26,0,0,Dislikes,Dislikes,yes,15,15,4,8
69,Fruit,Mango,Disliked,Cabbage,Disliked,23.73,male,Other,rest,married,£50+,3,13.5,19,2,25,1,14,16,2.01,1.29,0,0,Dislikes,Dislikes,26.3,13,18,0,.07,Strongly dislikes,Neither likes nor dislikes,29.7333333333333,15,18,0,.07,Dislikes,Neither likes nor dislikes,yes,14,10,1,2
71,Fruit,Rapberries,Disliked,tomatoes,Disliked,19.47,female,White British,rest,married,£50+,2,17,66,2,39,2,18,23,3.49,7.12,.07,.57,Strongly dislikes,Strongly dislikes,21.8666666666667,16,23,0,0,Dislikes,Strongly dislikes,24.7666666666667,20,23,0,.71,Dislikes,Likes,yes,12,11,2,5
72,Fruit,pineapple,Disliked,peas,Disliked,23.4,female,Other,degree or higher,married,rest, ,13.5,39,2,28,1,6,9,2.49,1.36,0,.07,Dislikes,Dislikes,25.0333333333333,6,12,1,1,Strongly likes,Neither likes nor dislikes,28.5333333333333,12,14,.07,.29,Strongly likes,Neither likes nor dislikes,yes,15,14,14,14
73,Fruit,Apples,Disliked,Parsnips,Disliked,21.03,female,White British,rest,rest,rest,1,11.5,23,2,25,1,12,15,5.56,1.57,0,0,Strongly dislikes,Never tried,22.4666666666667,15,15,1,1,Strongly likes,Neither likes nor dislikes,25.7333333333333,18,20,1,.14,Strongly likes,Likes,yes,15,12,15,12
74,Fruit,KIWI,Disliked,BROCCOLI,Disliked,21.03,female,White British,degree or higher,married,£50+,2,12,37,2,31,0,19,18,5.65,2.86,0,0,Dislikes,Neither likes nor dislikes,22.5666666666667,21,19,.07,.14,Neither likes nor dislikes,Neither likes nor dislikes, , , , , , , ,yes,12,10,4,2
75,Fruit,tomato,Disliked,cucumber,Disliked,20.17,male,White British,degree or higher,married,£50+,1,8.5,49,2,29,1,17,19,2.85,1.69,.29,0,Dislikes,Dislikes,22.4,17,17,.57,.57,Neither likes nor dislikes,Neither likes nor dislikes,25.0333333333333,12,15,.14,.14,Neither likes nor dislikes,Neither likes nor dislikes,yes,15,15,13,14
76,Fruit,satsuma,Disliked,tomato,Disliked,21.93,male,White British,degree or higher,married, ,1,11.5,32,1,23,1,12,13,2.35,3.12,0,.57,Dislikes,Strongly dislikes,24.0666666666667,12,16,0,.43,Neither likes nor dislikes,Dislikes,26.3,12,13,0,.43,Neither likes nor dislikes,Dislikes,yes,11,7,9,1
77,Fruit,Apricots,Unfamiliar,Butternut squash,Disliked,23.17,female,Other,degree or higher,married,rest,3,17,36,1,36,0,16,15,10.35,3.85,0,0,Never tried,Dislikes,26.6333333333333,13,16,0,.43,Dislikes,Neither likes nor dislikes,29.2,13,15,0,.14,Dislikes,Neither likes nor dislikes,yes,13,13,9,8
78,Fruit,apple,Unfamiliar,lettuce,Disliked,20.73,male,White British,degree or higher,married,rest,2,13.5,30,2,31,2,11,12,2.08,3.54,0,0, ,Dislikes,22.2,14,16,.86,.43,Likes,Strongly dislikes,25.5333333333333,12,12,.14,0,Likes,Strongly dislikes,yes,12,6,9,3
80,Fruit,Kiwi,Unfamiliar,Broccoli,Disliked,22.37,female,White British,rest,married,£50+,1,8.5,43,2,42,1,14,17,7.01,3.44,0,0,Never tried,Dislikes,24.1666666666667,14,17,.43,.43,Neither likes nor dislikes,Neither likes nor dislikes, , , , , , , ,yes,11,9,6,7
81,Fruit,nectarine,Unfamiliar,artichoke,Unfamiliar,22.13,male,White British,degree or higher,married,rest,2,15,42,0,30,0,6,7,7.07,3.94,0,0,Never tried,Never tried,23.7,6,8,0,0,Likes,Strongly likes,27.0333333333333,6,8,0,0,Likes,Strongly likes,yes,14,12,13,12